Target
Serine hydroxymethyltransferase, mitochondrial
Ligand
BDBM285683
Substrate
Meas. Tech.
Inhibition of Human SHMT
pH
7.4±n/a
IC50
500±n/a nM
Comments
extracted
Citation
 Rabinowitz, JDKim, HDucker, GSGhergurovich, JM SHMT inhibitors US Patent  US10077273 Publication Date 9/18/2018 
Target
Name:
Serine hydroxymethyltransferase, mitochondrial
Synonyms:
GLYM_HUMAN SHMT Serine methylase
Type:
Enzyme Catalytic Domain
Mol. Mass.:
56004.42
Organism:
Homo sapiens (Human)
Description:
Residue:
504
  
Inhibitor
Name:
BDBM285683
Synonyms:
US10077273, Compound HK-13 | US10934305, Compound HK-13
Type:
Small organic molecule
Emp. Form.:
C18H19ClN4O2
Mol. Mass.:
358.822
SMILES:
COc1cc(Cl)cc(c1)C1(C(C)C)c2c(C)n[nH]c2OC(N)=C1C#N
: