Target
Serine hydroxymethyltransferase, cytosolic
Ligand
BDBM285685
Substrate
Meas. Tech.
Inhibition of Human SHMT
pH
7.4±n/a
IC50
20.0±n/a nM
Comments
extracted
Citation
 Rabinowitz, JDKim, HDucker, GSGhergurovich, JM SHMT inhibitors US Patent  US10077273 Publication Date 9/18/2018 
Target
Name:
Serine hydroxymethyltransferase, cytosolic
Synonyms:
GLYC_HUMAN SHMT Serine methylase
Type:
PROTEIN
Mol. Mass.:
53091.10
Organism:
Homo sapiens (Human)
Description:
ChEMBL_745716
Residue:
483
  
Inhibitor
Name:
BDBM285685
Synonyms:
US10077273, Compound HK-15 | US10934305, Compound HK-15
Type:
Small organic molecule
Emp. Form.:
C18H16ClF3N4O
Mol. Mass.:
396.794
SMILES:
CC(C)C1(c2c(C)n[nH]c2OC(N)=C1C#N)c1cc(Cl)cc(c1)C(F)(F)F
: