Target
Serine hydroxymethyltransferase, mitochondrial
Ligand
BDBM285688
Substrate
Meas. Tech.
Inhibition of Human SHMT
pH
7.4±n/a
IC50
13.0±n/a nM
Comments
extracted
Citation
 Rabinowitz, JDKim, HDucker, GSGhergurovich, JM SHMT inhibitors US Patent  US10077273 Publication Date 9/18/2018 
Target
Name:
Serine hydroxymethyltransferase, mitochondrial
Synonyms:
GLYM_HUMAN SHMT Serine methylase
Type:
Enzyme Catalytic Domain
Mol. Mass.:
56004.42
Organism:
Homo sapiens (Human)
Description:
Residue:
504
  
Inhibitor
Name:
BDBM285688
Synonyms:
US10077273, Compound HK-X2 | US10934305, Compound HK-X2
Type:
Small organic molecule
Emp. Form.:
C24H24N4O2
Mol. Mass.:
400.473
SMILES:
CC(C)C1(c2c(C)n[nH]c2OC(N)=C1C#N)c1cc(CO)cc(c1)-c1ccccc1
: