Target
Serine hydroxymethyltransferase, mitochondrial
Ligand
BDBM285689
Substrate
Meas. Tech.
Inhibition of Human SHMT
pH
7.4±n/a
IC50
7.80±n/a nM
Comments
extracted
Citation
 Rabinowitz, JDKim, HDucker, GSGhergurovich, JM SHMT inhibitors US Patent  US10077273 Publication Date 9/18/2018 
Target
Name:
Serine hydroxymethyltransferase, mitochondrial
Synonyms:
GLYM_HUMAN SHMT Serine methylase
Type:
Enzyme Catalytic Domain
Mol. Mass.:
56004.42
Organism:
Homo sapiens (Human)
Description:
Residue:
504
  
Inhibitor
Name:
BDBM285689
Synonyms:
US10077273, Compound HK-X3 | US10934305, Compound HK-X3
Type:
Small organic molecule
Emp. Form.:
C26H27N5O3
Mol. Mass.:
457.5243
SMILES:
CC(C)C1(c2c(C)n[nH]c2OC(N)=C1C#N)c1cc(CO)cc(c1)-c1cccc(CC(N)=O)c1
: