Target
Procathepsin L
Ligand
BDBM138148
Substrate
Meas. Tech.
Biological Assay
pH
5.5±n/a
IC50
>10000±n/a nM
Comments
extracted
Citation
 Chaplin, DJGaddale Devanna, KKParker, EPinney, KGSong, JTrawick, ML Compositions and methods for inhibition of cathepsins US Patent  US8877967 Publication Date 11/4/2014 
Target
Name:
Procathepsin L
Synonyms:
CATL1_HUMAN CTSL CTSL1 Cathepsin L Cathepsin L1 heavy chain MEP cathepsin L preproprotein
Type:
Enzyme
Mol. Mass.:
37557.19
Organism:
Homo sapiens (Human)
Description:
Purchased from Calbiochem (San Diego, CA).
Residue:
333
  
Inhibitor
Name:
BDBM138148
Synonyms:
US8877967, 18
Type:
Small organic molecule
Emp. Form.:
C22H19N3O3S
Mol. Mass.:
405.47
SMILES:
COc1ccc(cc1)C(=O)c1cccc(c1)C(=NNC(N)=S)c1ccc(O)cc1
: