Target
Cathepsin K
Ligand
BDBM138144
Substrate
Meas. Tech.
Biological Assay
pH
3.5±n/a
Temperature
298.15±n/a K
IC50
1034±n/a nM
Comments
extracted
Citation
 Chaplin, DJGaddale Devanna, KKParker, EPinney, KGSong, JTrawick, ML Compositions and methods for inhibition of cathepsins US Patent  US8877967 Publication Date 11/4/2014 
Target
Name:
Cathepsin K
Synonyms:
CATK_HUMAN CTSO Cathepsin O Cathepsin X
Type:
Enzyme
Mol. Mass.:
36975.68
Organism:
Homo sapiens (Human)
Description:
P43235
Residue:
329
  
Inhibitor
Name:
BDBM138144
Synonyms:
US8877967, 9
Type:
Small organic molecule
Emp. Form.:
C23H21N3OS
Mol. Mass.:
387.497
SMILES:
Cc1cccc(c1)C(=O)c1cccc(c1)C(=NNC(N)=S)c1cccc(C)c1
: