Target
Cathepsin K
Ligand
BDBM138154
Substrate
Meas. Tech.
Biological Assay
pH
3.5±n/a
Temperature
298.15±n/a K
IC50
2796±n/a nM
Comments
extracted
Citation
 Chaplin, DJGaddale Devanna, KKParker, EPinney, KGSong, JTrawick, ML Compositions and methods for inhibition of cathepsins US Patent  US8877967 Publication Date 11/4/2014 
Target
Name:
Cathepsin K
Synonyms:
CATK_HUMAN CTSO Cathepsin O Cathepsin X
Type:
Enzyme
Mol. Mass.:
36975.68
Organism:
Homo sapiens (Human)
Description:
P43235
Residue:
329
  
Inhibitor
Name:
BDBM138154
Synonyms:
US8877967, 25
Type:
Small organic molecule
Emp. Form.:
C28H21N3O2S
Mol. Mass.:
463.55
SMILES:
NC(=S)NN=C(c1ccccc1)c1cc(cc(c1)C(=O)c1ccccc1)C(=O)c1ccccc1
: