Target
Cathepsin B
Ligand
BDBM138145
Substrate
Meas. Tech.
Biological Assay
pH
6±n/a
IC50
>10000±n/a nM
Comments
extracted
Citation
 Chaplin, DJGaddale Devanna, KKParker, EPinney, KGSong, JTrawick, ML Compositions and methods for inhibition of cathepsins US Patent  US8877967 Publication Date 11/4/2014 
Target
Name:
Cathepsin B
Synonyms:
APP secretase CATB_HUMAN CTSB Cathepsin B light chain | Cathepsin B1
Type:
Enzyme
Mol. Mass.:
37819.69
Organism:
Homo sapiens (Human)
Description:
gi_63102437
Residue:
339
  
Inhibitor
Name:
BDBM138145
Synonyms:
US8877967, 11
Type:
Small organic molecule
Emp. Form.:
C21H14BrF2N3OS
Mol. Mass.:
474.321
SMILES:
NC(=S)NN=C(c1cc(Br)cc(c1)C(=O)c1ccccc1F)c1ccccc1F
: