Target
Acetyl-CoA carboxylase 2
Ligand
BDBM138531
Substrate
Meas. Tech.
Spectrophotometric 384 Well Assay
pH
7.5±n/a
IC50
556±n/a nM
Comments
extracted
Citation
 Fleck, MHeine, NNosse, BRoth, GJ Pyrrolidine derivatives, pharmaceutical compositions and uses thereof US Patent  US8877741 Publication Date 11/4/2014 
Target
Name:
Acetyl-CoA carboxylase 2
Synonyms:
ACACB ACC-beta ACCB Acetyl-CoA carboxylase 2 Acetyl-CoA carboxylase 2 (ACC2)
Type:
Protein
Mol. Mass.:
276535.21
Organism:
Homo sapiens (Human)
Description:
O00763
Residue:
2458
  
Inhibitor
Name:
BDBM138531
Synonyms:
US8877741, 1.9
Type:
Small organic molecule
Emp. Form.:
C21H26FN3O3
Mol. Mass.:
387.4478
SMILES:
CCOc1cnc(N2CCC(C2)Oc2ccc(cc2)[C@H](C)NC(C)=O)c(F)c1
: