Target
Vascular endothelial growth factor receptor 2
Ligand
BDBM139602
Substrate
Meas. Tech.
Kinase Assay
pH
7.4±n/a
IC50
27±n/a nM
Comments
extracted
Citation
 Hull, III, CEMalone, TC Kinase inhibitors US Patent  US8889870 Publication Date 11/18/2014 
Target
Name:
Vascular endothelial growth factor receptor 2
Synonyms:
CD_antigen=CD309 Fetal liver kinase 1 (FLK-1) KDR Protein-tyrosine kinase receptor Flk-1 VEGFR-2 VEGFR2 Vascular Endothelial Growth Factor Receptor Kinase 2 Vascular endothelial growth factor receptor 2 (KDR) Vascular endothelial growth factor receptor 2 (VEGFR2) Vascular endothelial growth factor receptor-2 (VEGFR-2)
Type:
Receptor Tyrosine Kinase
Mol. Mass.:
151510.97
Organism:
Homo sapiens (Human)
Description:
P35968
Residue:
1356
  
Inhibitor
Name:
BDBM139602
Synonyms:
US8889870, 148 US9820989, 148
Type:
Small organic molecule
Emp. Form.:
C22H20F3N5O
Mol. Mass.:
427.4223
SMILES:
Cc1cc(cc(c1)C(=O)Nc1cccc(c1)C(F)(F)F)N1CCc2nc(N)ncc2C1
: