Target
Cannabinoid receptor 2
Ligand
BDBM139885
Substrate
Meas. Tech.
Radioligand Binding Assays
Ki
9.9±n/a nM
Citation
 Frost, JMLatshaw, SPDart, MJCarroll, WAPerez-Medrano, AKolasa, TPatel, MVNelson, DWLi, TPeddi, SWang, XLiu, B Compounds as cannabinoid receptor ligands US Patent  US8895592 Publication Date 11/25/2014 
Target
Name:
Cannabinoid receptor 2
Synonyms:
CANNABINOID CB2 CB2 CB2B CNR2_HUMAN Cannabinoid CB2 receptor Cannabinoid receptor 2 (CB2R) | hCB2
Type:
G Protein-Coupled Receptor (GPCR)
Mol. Mass.:
39690.94
Organism:
Homo sapiens (Human)
Description:
P34972
Residue:
360
  
Inhibitor
Name:
BDBM139885
Synonyms:
US8895592, 15
Type:
Small organic molecule
Emp. Form.:
C21H27ClN2O2S
Mol. Mass.:
406.969
SMILES:
CC(C)Cn1cc(s\c1=N/C(=O)c1cc(Cl)ccc1OC1CC1)C(C)(C)C
: