Target
Interleukin-6
Ligand
BDBM140018
Substrate
Meas. Tech.
Fluorescence Polarization Ligand Binding Assay
IC50
4.3±n/a nM
Citation
 Rucker, PVSnyder, JS Tricyclic compounds, compositions, and methods US Patent  US8901310 Publication Date 12/2/2014 
Target
Name:
Interleukin-6
Synonyms:
B-cell stimulatory factor 2 CDF Hybridoma growth factor IFNB2 IL6 Interferon beta-2
Type:
Mol. Mass.:
23717.96
Organism:
Homo sapiens (Human)
Description:
P05231
Residue:
212
  
Inhibitor
Name:
BDBM140018
Synonyms:
US8901310, Comparator H
Type:
Small organic molecule
Emp. Form.:
C29H30F2N2O2
Mol. Mass.:
476.5575
SMILES:
Cc1ncccc1NC(=O)c1ccc2c(CC[C@@H]3C[C@](O)(CC[C@@]23Cc2ccccc2)C(F)F)c1
: