Target
Dipeptidyl peptidase 4
Ligand
BDBM140272
Substrate
Meas. Tech.
Enzyme Inhibition Assay
pH
7.5±n/a
Temperature
310.15±n/a K
IC50
104±n/a nM
Comments
extracted
Citation
 Bennett, CEBurnett, DALi, HChen, YMcCracken, TVicarel, M Fused bicyclic heterocycles useful as dipeptidyl peptidase-IV inhibitors US Patent  US8907086 Publication Date 12/9/2014 
Target
Name:
Dipeptidyl peptidase 4
Synonyms:
ADABP Adenosine deaminase complexing protein 2 CD_antigen=CD26 DPP4 DPPIV Dipeptidyl peptidase 4 (DPP IV) Dipeptidyl peptidase 4 (DPP4) Dipeptidyl peptidase 4 membrane form Dipeptidyl peptidase IV Dipeptidyl peptidase IV (DDP-IV) Dipeptidyl peptidase IV membrane form Dipeptidyl peptidase-IV (DPP-4) T-cell activation antigen CD26 | TP103
Type:
Enzyme
Mol. Mass.:
88271.01
Organism:
Homo sapiens (Human)
Description:
P27487
Residue:
766
  
Inhibitor
Name:
BDBM140272
Synonyms:
US8907086, Example 8
Type:
Small organic molecule
Emp. Form.:
C29H27FN8O
Mol. Mass.:
522.5761
SMILES:
Cc1nc(Cn2c3nccc3c(N3CCCC(N)C3)n(Cc3cc(F)ccc3C#N)c2=O)nc2ccccc12
: