Target
Beta-2 adrenergic receptor
Ligand
BDBM103782
Substrate
Meas. Tech.
cAMP assays
Temperature
298.15±n/a K
EC50
1.00±n/a nM
Comments
extracted
Citation
 Hughes, ADByun, DChen, YFleury, MJacobsen, JRStangeland, ELWilson, RDYen, R Diamide compounds having muscarinic receptor antagonist and β2 adrenergic receptor agonist activity US Patent  US9682957 Publication Date 6/20/2017 
Target
Name:
Beta-2 adrenergic receptor
Synonyms:
ADRB2 ADRB2_HUMAN Beta-2 adrenoceptor | Beta-2 adrenoreceptor
Type:
Mol. Mass.:
46461.69
Organism:
Homo sapiens (Human)
Description:
P07550
Residue:
413
  
Inhibitor
Name:
BDBM103782
Synonyms:
US8551978, I-52 US9394275, I-52 US9682957, I-52
Type:
Small organic molecule
Emp. Form.:
C50H54N6O7
Mol. Mass.:
850.9998
SMILES:
CC(Cc1cccc(CC(=O)Nc2cccc(c2)N(C)C(=O)CCN2CCC(CC2)OC(=O)Nc2ccccc2-c2ccccc2)c1)NC[C@H](O)c1ccc(O)c2[nH]c(=O)ccc12
: