Target
Neuropeptide Y receptor type 5
Ligand
BDBM141357
Substrate
Meas. Tech.
Binding Assay
pH
7.4±n/a
Temperature
298.15±n/a K
IC50
0.5±n/a nM
Citation
 Hayashi, KTamura, YOmori, N 5-membered ring heteroaromatic derivatives having NPY Y5 receptor antagonistic activity US Patent  US8916594 Publication Date 12/23/2014 
Target
Name:
Neuropeptide Y receptor type 5
Synonyms:
NPY-Y5 Neuropeptide Y receptor Y5 Npy5 | Npy5r
Type:
Enzyme
Mol. Mass.:
52807.91
Organism:
Mus musculus (Mouse)
Description:
O70342
Residue:
466
  
Inhibitor
Name:
BDBM141357
Synonyms:
US8916594, I-138
Type:
Small organic molecule
Emp. Form.:
C16H27FN4O3S
Mol. Mass.:
374.474
SMILES:
CCS(=O)(=O)NC[C@H]1CC[C@@H](CC1)Nc1nc(no1)C1(F)CCCC1
: