Target
Plasminogen
Ligand
BDBM141392
Substrate
Meas. Tech.
Enzyme Assay
pH
8±n/a
Ki
5.4±n/a nM
Comments
extracted
Citation
 Steinmetzer, TSaupe, SM Serine protease inhibitors US Patent  US8921319 Publication Date 12/30/2014 
Target
Name:
Plasminogen
Synonyms:
Activation peptide PLG Plasmin Plasmin heavy chain A, short form | Plasmin light chain B
Type:
Enzyme
Mol. Mass.:
90579.18
Organism:
Homo sapiens (Human)
Description:
Residue:
810
  
Inhibitor
Name:
BDBM141392
Synonyms:
US8921319, 14
Type:
Small organic molecule
Emp. Form.:
C33H35N11O4S
Mol. Mass.:
681.767
SMILES:
NC(=N)c1ccc(CNC(=O)[C@@H]2Cc3cn(Cc4ccc(Cn5cc(C[C@@H](NS(=O)(=O)Cc6ccccc6)C(=O)N2)nn5)cc4)nn3)cc1
: