Target
Neuronal acetylcholine receptor subunit alpha-4
Ligand
BDBM141872
Substrate
Meas. Tech.
Radioligand Binding
Temperature
294.15±n/a K
Ki
65±n/a nM
Comments
extracted
Citation
 Mazurov, AMiao, LXiao, Y Nicotinic acetylcholine receptor sub-type selective amides of diazabicycloalkanes US Patent  US8921410 Publication Date 12/30/2014 
Target
Name:
Neuronal acetylcholine receptor subunit alpha-4
Synonyms:
ACHA4_RAT Cholinergic, Nicotinic Alpha4Beta2 Chrna4 Neuronal acetylcholine receptor (alpha4beta2 nAChR) Neuronal acetylcholine receptor subunit alpha 4 beta 2 | Neuronal acetylcholine receptor subunit alpha-4
Type:
Enzyme
Mol. Mass.:
70196.44
Organism:
Rattus norvegicus (Rat)
Description:
P09483
Residue:
630
  
Inhibitor
Name:
BDBM141872
Synonyms:
US8921410, Table 1 Compound 41
Type:
Small organic molecule
Emp. Form.:
C12H15FN2O2
Mol. Mass.:
238.2581
SMILES:
Cc1cc(F)c(o1)C(=O)N1CC2CNCC2C1
: