Target
Casein kinase II subunit alpha
Ligand
BDBM142805
Substrate
Meas. Tech.
Kinase Assay
pH
7.4±n/a
Temperature
303.15±n/a K
IC50
5.87±n/a nM
Comments
extracted
Citation
 Purandare, AVFink, BEGavai, AVJohnson, WLHart, ACHe, LHuynh, TNInghrim, JMastalerz, HSang, XTarby, CMWan, HVaccaro, WZhang, GZhao, YZimmermann, K Imidazotriazinecarbonitriles useful as kinase inhibitors US Patent  US8940736 Publication Date 1/27/2015 
Target
Name:
Casein kinase II subunit alpha
Synonyms:
CK II CK2- alpha CSK21_HUMAN Casein kinase 2 Casein kinase II alpha/beta Casein kinase II subunit alpha (CK2A1) Casein kinase II subunit alpha (CK2a V66A) Casein kinase II subunit alpha (CK2a)
Type:
Enzyme
Mol. Mass.:
45151.12
Organism:
Homo sapiens (Human)
Description:
P68400
Residue:
391
  
Inhibitor
Name:
BDBM142805
Synonyms:
US8940736, 224
Type:
Small organic molecule
Emp. Form.:
C24H23ClF3N9
Mol. Mass.:
529.948
SMILES:
FC(F)(F)CCN1CCC(CC1)c1cc(cc(Nc2nc(NC3CC3)c3ncc(C#N)n3n2)c1Cl)C#N
: