Target
Sodium channel protein type 9 subunit alpha
Ligand
BDBM145481
Substrate
Meas. Tech.
Radioligand Binding Assay
pH
7.4±n/a
Temperature
298.15±n/a K
IC50
3±n/a nM
Comments
extracted
Citation
 Andrez, JChowdhury, SDecker, SMDehnhardt, CMFocken, TGrimwood, MEHemeon, IWJia, QLi, JOrtwine, DFSafina, BSheng, TSun, SSutherlin, DPWilson, MSZenova, AY N-substituted benzamides and methods of use thereof US Patent  US8952169 Publication Date 2/10/2015 
Target
Name:
Sodium channel protein type 9 subunit alpha
Synonyms:
NENA Peripheral sodium channel 1 SCN9A_HUMAN Voltage-gated sodium channel subunit Nav1.7 hNE-Na
Type:
Protein
Mol. Mass.:
226375.97
Organism:
Homo sapiens (Human)
Description:
Q15858
Residue:
1988
  
Inhibitor
Name:
BDBM145481
Synonyms:
US8952169, 262
Type:
Small organic molecule
Emp. Form.:
C24H28F3NO4S
Mol. Mass.:
483.544
SMILES:
Fc1cc(OCC23CC4CC(C2)C(F)(F)C(C4)C3)c(cc1C(=O)NS(=O)(=O)C1CC1)C1CC1
: