Target
Sodium channel protein type 9 subunit alpha
Ligand
BDBM145303
Substrate
Meas. Tech.
Electrophysiological Assay
Temperature
310.15±n/a K
IC50
41.6±n/a nM
Comments
extracted
Citation
 Andrez, JChowdhury, SDecker, SMDehnhardt, CMFocken, TGrimwood, MEHemeon, IWJia, QLi, JOrtwine, DFSafina, BSheng, TSun, SSutherlin, DPWilson, MSZenova, AY N-substituted benzamides and methods of use thereof US Patent  US8952169 Publication Date 2/10/2015 
Target
Name:
Sodium channel protein type 9 subunit alpha
Synonyms:
NENA Peripheral sodium channel 1 SCN9A_HUMAN Voltage-gated sodium channel subunit Nav1.7 hNE-Na
Type:
Protein
Mol. Mass.:
226375.97
Organism:
Homo sapiens (Human)
Description:
Q15858
Residue:
1988
  
Inhibitor
Name:
BDBM145303
Synonyms:
US8952169, 82 | US9771376, Example 82
Type:
Small organic molecule
Emp. Form.:
C15H17ClF4N2O4S
Mol. Mass.:
432.818
SMILES:
CN(C)S(=O)(=O)NC(=O)c1cc(Cl)c(OCC2(CCC2)C(F)(F)F)cc1F
: