Target
Ribosomal protein S6 kinase alpha-3
Ligand
BDBM286076
Substrate
Meas. Tech.
Radioisotope assay
IC50
>10000±n/a nM
Citation
 Dunn, SEJayanthan, ANagireddy, JRAnnedi, SVan Drie, JHDaynard, TSHuynh, M Substituted tetrahydropyrido[3′,2′:4,5]pyrrolo[1,2-α]pyrazine-2-carboxamides as RSK inhibitors US Patent  US10081632 Publication Date 9/25/2018 
Target
Name:
Ribosomal protein S6 kinase alpha-3
Synonyms:
90 kDa ribosomal protein S6 kinase 3 ISPK1 MAP kinase-activated protein kinase 1b RPS6KA3 RSK2 Ribosomal protein S6 kinase Ribosomal protein S6 kinase alpha-3 (RSK2) S6K-alpha 3 p90 ribosomal s6 kinase (RSK2) p90RSK | pp90RSK2
Type:
Serine/threonine-protein kinase
Mol. Mass.:
83740.03
Organism:
Homo sapiens (Human)
Description:
The human RSK2 sequence differed from the Genbank entry NM_004586 at one residue, V45G. The protein was cloned and purified from baculovirus expression system.
Residue:
740
  
Inhibitor
Name:
BDBM286076
Synonyms:
1-Benzyl-N-(3-((4-methylpiperazin-1-yl)methyl)-1H-indol-5-yl)-1H-pyrazole-4-carboxamide US10758530, Compound 3 | US9771366, Compound 3
Type:
Small organic molecule
Emp. Form.:
C25H28N6O
Mol. Mass.:
428.5294
SMILES:
CN1CCN(Cc2c[nH]c3ccc(NC(=O)c4cnn(Cc5ccccc5)c4)cc23)CC1
: