Target
Peroxisome proliferator-activated receptor gamma
Ligand
BDBM147334
Substrate
Meas. Tech.
Lanthascreen Competitive Binding Assay
IC50
<1±n/a nM
Citation
 Kamenecka, TMGriffin, PRKoenig, MAsteian, ABlayo, AHe, YShin, Y N-biphenylmethylindole modulators of PPARG US Patent  US8957093 Publication Date 2/17/2015 
Target
Name:
Peroxisome proliferator-activated receptor gamma
Synonyms:
NR1C3 PPAR-gamma PPARG_HUMAN Peroxisome proliferator-activated receptor gamma (PPAR gamma) Peroxisome proliferator-activated receptor gamma (PPARĪ³) peroxisome proliferator-activated receptor gamma isoform 2
Type:
Nuclear Receptor
Mol. Mass.:
57613.46
Organism:
Homo sapiens (Human)
Description:
P37231
Residue:
505
  
Inhibitor
Name:
BDBM147334
Synonyms:
US8957093, 166
Type:
Small organic molecule
Emp. Form.:
C35H36N2O
Mol. Mass.:
500.6731
SMILES:
CC(C)c1cccc(c1)[C@@H](C)NC(=O)c1ccc2n(Cc3ccc(cc3)-c3ccccc3)c(C)c(C)c2c1
: