Target
Cannabinoid receptor 1
Ligand
BDBM286107
Substrate
Meas. Tech.
Competition Displacement Assay
IC50
>1000±n/a nM
Citation
 McElroy, JFChorvat, RJ Cannabinoid receptor antagonists/inverse agonists useful for treating metabolic disorders, including obesity and diabetes US Patent  US9517228 Publication Date 12/13/2016 
Target
Name:
Cannabinoid receptor 1
Synonyms:
CANN6 CB-R CNR CNR1_HUMAN Cannabinoid receptor Cannabinoid receptor 1 (brain)
Type:
G Protein-Coupled Receptor (GPCR)
Mol. Mass.:
52868.96
Organism:
Homo sapiens (Human)
Description:
P21554
Residue:
472
  
Inhibitor
Name:
BDBM286107
Synonyms:
US10617673, Example 4a (2S,4'R) US9517228, Example 4a (2S,4′R) | US9987253, Example 4a
Type:
Small organic molecule
Emp. Form.:
C27H27Cl2N5O3S
Mol. Mass.:
572.506
SMILES:
CC(C)[C@H](N\C(=N/S(=O)(=O)c1ccc(Cl)cc1)N1C[C@H](C(=N1)c1ccc(Cl)cc1)c1ccccc1)C(N)=O
: