Target
Lymphokine-activated killer T-cell-originated protein kinase
Ligand
BDBM149027
Substrate
Meas. Tech.
Kinase Assay
pH
7.4±n/a
Temperature
298.15±n/a K
IC50
0.57±n/a nM
Comments
extracted
Citation
 Nakamura, YMatsuo, YHisada, SAhmed, FHuntley, RSajjadi-Hashemi, ZJenkins, DMKargbo, RBCui, WGauuan, PJWalker, JRDecornez, HGurram, M Tricyclic compounds and PBK inhibitors containing the same US Patent  US8962648 Publication Date 2/24/2015 
Target
Name:
Lymphokine-activated killer T-cell-originated protein kinase
Synonyms:
2.7.12.2 Cancer/testis antigen 84 Nori-3 PDZ-binding kinase Spermatogenesis-related protein kinase TOPK | TOPK_HUMAN
Type:
Mol. Mass.:
36072.55
Organism:
Homo sapiens (Human)
Description:
Residue:
322
  
Inhibitor
Name:
BDBM149027
Synonyms:
US8962648, 235
Type:
Small organic molecule
Emp. Form.:
C24H24FN3O2S
Mol. Mass.:
437.53
SMILES:
NCC1CCN(Cc2ccc(cc2F)-c2c(O)ccc3[nH]c(=O)c4sccc4c23)CC1
: