Target
Prostaglandin E2 receptor EP1 subtype
Ligand
BDBM50446847
Substrate
Meas. Tech.
In Vitro Binding Assay
pH
7.4±n/a
Ki
>17500±n/a nM
Comments
extracted
Citation
 Schiffler, MAYork, JS Phenoxyethyl piperidine compounds US Patent  US8962659 Publication Date 2/24/2015 
Target
Name:
Prostaglandin E2 receptor EP1 subtype
Synonyms:
PE2R1_HUMAN PTGER1 Prostaglandin E2 receptor EP1 subtype Prostanoid EP1 receptor
Type:
Enzyme
Mol. Mass.:
41834.57
Organism:
Homo sapiens (Human)
Description:
P34995
Residue:
402
  
Inhibitor
Name:
BDBM50446847
Synonyms:
CHEMBL3115074
Type:
Small organic molecule
Emp. Form.:
C23H28N2O4
Mol. Mass.:
396.4794
SMILES:
C[C@H](NC(=O)[C@H]1CCCCN1CCOc1ccccc1)c1ccc(cc1)C(O)=O
: