Target
Bromodomain-containing protein 4
Ligand
BDBM150090
Substrate
Meas. Tech.
TR-FRET In-Vitro Binding Assay
pH
7.5±n/a
Temperature
303.15±n/a K
IC50
78±n/a nM
Comments
extracted
Citation
 Bordas, VCotesta, SGuagnano, VRueeger, HVaupel, A Pyrazolopyrrolidine derivatives and their use in the treatment of disease US Patent  US8975417 Publication Date 3/10/2015 
Target
Name:
Bromodomain-containing protein 4
Synonyms:
BRD4 Bromodomain-containing protein 4 (BRD4) Protein HUNK1
Type:
Protein
Mol. Mass.:
152264.84
Organism:
Homo sapiens (Human)
Description:
O60885
Residue:
1362
  
Inhibitor
Name:
BDBM150090
Synonyms:
US8975417, 152
Type:
Small organic molecule
Emp. Form.:
C23H22ClN7O
Mol. Mass.:
447.92
SMILES:
Cc1nnc2c(C)cc(cn12)N1C(c2c(C)n(nc2C1=O)C1CNC1)c1ccc(Cl)cc1
: