Target
CREB-binding protein
Ligand
BDBM150090
Substrate
Meas. Tech.
AlphaScreen In-Vitro Binding Assay
pH
7.5±n/a
Temperature
303.15±n/a K
IC50
3100±n/a nM
Comments
extracted
Citation
 Bordas, VCotesta, SGuagnano, VRueeger, HVaupel, A Pyrazolopyrrolidine derivatives and their use in the treatment of disease US Patent  US8975417 Publication Date 3/10/2015 
Target
Name:
CREB-binding protein
Synonyms:
CBP CREB-binding protein (CBP) CREBBP
Type:
Transcription Coactivator
Mol. Mass.:
265411.66
Organism:
Homo sapiens (Human)
Description:
Q92793
Residue:
2442
  
Inhibitor
Name:
BDBM150090
Synonyms:
US8975417, 152
Type:
Small organic molecule
Emp. Form.:
C23H22ClN7O
Mol. Mass.:
447.92
SMILES:
Cc1nnc2c(C)cc(cn12)N1C(c2c(C)n(nc2C1=O)C1CNC1)c1ccc(Cl)cc1
: