Target
Calmodulin-domain protein kinase 1
Ligand
BDBM50446181
Substrate
Meas. Tech.
Luminescent Kinase Assay
IC50
2.00±n/a nM
Citation
 Fan, EVan Voorhis, WCZhang, ZHuang, WOjo, KK 5-aminopyrazole-4-carboxamide inhibitors of CDPK1 from T. gondii and C. parvum US Patent  US9518026 Publication Date 12/13/2016 
Target
Name:
Calmodulin-domain protein kinase 1
Synonyms:
Calmodulin-domain protein kinase 1 Calmodulin-domain protein kinase, putative
Type:
Enzyme Catalytic Domain
Mol. Mass.:
57248.42
Organism:
Toxoplasma gondii
Description:
Residue:
507
  
Inhibitor
Name:
BDBM50446181
Synonyms:
CHEMBL3108912 US9956214, Compound 1
Type:
Small organic molecule
Emp. Form.:
C18H20N4O
Mol. Mass.:
308.3776
SMILES:
CC(C)(C)n1nc(c(C(N)=O)c1N)-c1ccc2ccccc2c1
: