Target
Calmodulin-domain protein kinase 1
Ligand
BDBM50148737
Substrate
Meas. Tech.
Luminescent Kinase Assay
IC50
5.00±n/a nM
Citation
 Fan, EVan Voorhis, WCZhang, ZHuang, WOjo, KK 5-aminopyrazole-4-carboxamide inhibitors of CDPK1 from T. gondii and C. parvum US Patent  US9518026 Publication Date 12/13/2016 
Target
Name:
Calmodulin-domain protein kinase 1
Synonyms:
Calmodulin-domain protein kinase 1 Calmodulin-domain protein kinase, putative
Type:
Enzyme Catalytic Domain
Mol. Mass.:
57248.42
Organism:
Toxoplasma gondii
Description:
Residue:
507
  
Inhibitor
Name:
BDBM50148737
Synonyms:
CHEMBL3770076 US9956214, Compound 1585
Type:
Small organic molecule
Emp. Form.:
C21H25N5O2
Mol. Mass.:
379.4555
SMILES:
CC(C)(C)n1nc(c(C(N)=O)c1N)-c1cnc2cc(OCC3CC3)ccc2c1
: