Target
Carbonic anhydrase 1
Ligand
BDBM150251
Substrate
Meas. Tech.
Inhibition Assay
pH
7.5±n/a
Ki
79±n/a nM
Comments
extracted
Citation
 Lambin, PWinum, JSupuran, C Cancer targeting using carbonic anhydrase isoform IX inhibitors US Patent  US8980932 Publication Date 3/17/2015 
Target
Name:
Carbonic anhydrase 1
Synonyms:
CA-I CAB Carbonate dehydratase I Carbonic anhydrase 1 (CA I) Carbonic anhydrase 1 (Recombinant CA I) Carbonic anhydrase B Carbonic anhydrase I (CA I) Carbonic anhydrase I (CAI) Carbonic anhydrase isoenzyme I (hCA I) | hCA
Type:
Enzyme
Mol. Mass.:
28873.37
Organism:
Homo sapiens (Human)
Description:
P00915
Residue:
261
  
Inhibitor
Name:
BDBM150251
Synonyms:
US8980932, 6c (DH310)
Type:
Small organic molecule
Emp. Form.:
C15H20N6O4S2
Mol. Mass.:
412.487
SMILES:
Cc1ncc(n1CCNC(=S)NCCc1ccc(cc1)S(N)(=O)=O)[N+]([O-])=O
: