Target
Carbonic anhydrase 2
Ligand
BDBM150250
Substrate
Meas. Tech.
Inhibition Assay
pH
7.5±n/a
Ki
7.4±n/a nM
Comments
extracted
Citation
 Lambin, PWinum, JSupuran, C Cancer targeting using carbonic anhydrase isoform IX inhibitors US Patent  US8980932 Publication Date 3/17/2015 
Target
Name:
Carbonic anhydrase 2
Synonyms:
CA-II CAC Carbonate dehydratase II Carbonic anhydrase 2 (CA-II) Carbonic anhydrase C Carbonic anhydrase II (CA-II) Carbonic anhydrase II (hCA II) | Carbonic anhydrase isoenzyme II (hCA II)
Type:
Enzyme
Mol. Mass.:
29250.71
Organism:
Homo sapiens (Human)
Description:
P00918
Residue:
260
  
Inhibitor
Name:
BDBM150250
Synonyms:
US8980932, 6b (DH309)
Type:
Small organic molecule
Emp. Form.:
C14H18N6O4S2
Mol. Mass.:
398.461
SMILES:
Cc1ncc(n1CCNC(=S)NCc1ccc(cc1)S(N)(=O)=O)[N+]([O-])=O
: