Target
Carbonic anhydrase 2
Ligand
BDBM150253
Substrate
Meas. Tech.
Inhibition Assay
pH
7.5±n/a
Ki
330±n/a nM
Comments
extracted
Citation
 Lambin, PWinum, JSupuran, C Cancer targeting using carbonic anhydrase isoform IX inhibitors US Patent  US8980932 Publication Date 3/17/2015 
Target
Name:
Carbonic anhydrase 2
Synonyms:
CA-II CAC Carbonate dehydratase II Carbonic anhydrase 2 (CA-II) Carbonic anhydrase C Carbonic anhydrase II (CA-II) Carbonic anhydrase II (hCA II) | Carbonic anhydrase isoenzyme II (hCA II)
Type:
Enzyme
Mol. Mass.:
29250.71
Organism:
Homo sapiens (Human)
Description:
P00918
Residue:
260
  
Inhibitor
Name:
BDBM150253
Synonyms:
US8980932, 4a (DH296)
Type:
Small organic molecule
Emp. Form.:
C11H11N5O5S
Mol. Mass.:
325.301
SMILES:
NS(=O)(=O)c1ccc(NC(=O)Cn2ccnc2[N+]([O-])=O)cc1
: