Target
Carbonic anhydrase 9
Ligand
BDBM150252
Substrate
Meas. Tech.
Inhibition Assay
pH
7.5±n/a
Ki
7.8±n/a nM
Comments
extracted
Citation
 Lambin, PWinum, JSupuran, C Cancer targeting using carbonic anhydrase isoform IX inhibitors US Patent  US8980932 Publication Date 3/17/2015 
Target
Name:
Carbonic anhydrase 9
Synonyms:
CA-IX CAH9_HUMAN Carbonic anhydrase 9 (CA IX) Carbonic anhydrase 9 precursor Carbonic anhydrase IX (CAIX) Carbonic anhydrases; II & IX MN RCC-associated antigen G250
Type:
Enzyme
Mol. Mass.:
49669.03
Organism:
Homo sapiens (Human)
Description:
Catalytic domain of human cloned isozyme was used in the assay
Residue:
459
  
Inhibitor
Name:
BDBM150252
Synonyms:
US8980932, 6d (DH308)
Type:
Small organic molecule
Emp. Form.:
C13H16N6O4S2
Mol. Mass.:
384.434
SMILES:
Cc1ncc(n1CCNC(=S)Nc1cccc(c1)S(N)(=O)=O)[N+]([O-])=O
: