Target
Carbonic anhydrase 9
Ligand
BDBM150254
Substrate
Meas. Tech.
Inhibition Assay
pH
7.5±n/a
Ki
7.3±n/a nM
Comments
extracted
Citation
 Lambin, PWinum, JSupuran, C Cancer targeting using carbonic anhydrase isoform IX inhibitors US Patent  US8980932 Publication Date 3/17/2015 
Target
Name:
Carbonic anhydrase 9
Synonyms:
CA-IX CAH9_HUMAN Carbonic anhydrase 9 (CA IX) Carbonic anhydrase 9 precursor Carbonic anhydrase IX (CAIX) Carbonic anhydrases; II & IX MN RCC-associated antigen G250
Type:
Enzyme
Mol. Mass.:
49669.03
Organism:
Homo sapiens (Human)
Description:
Catalytic domain of human cloned isozyme was used in the assay
Residue:
459
  
Inhibitor
Name:
BDBM150254
Synonyms:
US8980932, 4d (DH302)
Type:
Small organic molecule
Emp. Form.:
C11H11N5O5S
Mol. Mass.:
325.301
SMILES:
NS(=O)(=O)c1cccc(NC(=O)Cn2ccnc2[N+]([O-])=O)c1
: