Target
C-X-C chemokine receptor type 2
Ligand
BDBM150963
Substrate
Meas. Tech.
In Vitro Inhibition Assay
Temperature
310.15±n/a K
IC50
529±n/a nM
Comments
extracted
Citation
 Maeda, DYZebala, JA Pyrimidinecarboxamides as CXCR2 modulators US Patent  US8981106 Publication Date 3/17/2015 
Target
Name:
C-X-C chemokine receptor type 2
Synonyms:
C-X-C chemokine receptor type 2 (CXCR-2) CD_antigen=CD182 CXCR-2 CXCR2_HUMAN GRO/MGSA receptor IL-8 receptor type 2 IL8RB | Interleukin-8 receptor B
Type:
Protein
Mol. Mass.:
40767.88
Organism:
Homo sapiens (Human)
Description:
P25025
Residue:
360
  
Inhibitor
Name:
BDBM150963
Synonyms:
US8981106, 152
Type:
Small organic molecule
Emp. Form.:
C22H16BrFN2O3S
Mol. Mass.:
487.341
SMILES:
Fc1ccc(NC(=O)c2ccc(SCC(=O)c3cc(Br)cc4CCOc34)nc2)cc1
: