Target
Peptidyl-prolyl cis-trans isomerase F, mitochondrial
Ligand
BDBM50030542
Substrate
Meas. Tech.
Surface Plasmon Resonance (SPR) Assay
pH
7.4±n/a
Kd
2.20±n/a nM
Comments
extracted
Citation
 Fu, JKarur, SLi, XLu, PMergo, WRivkin, ASweeney, ZKTjandra, MWeiss, AYifru, A Cyclic peptides and use as medicines US Patent  US9566312 Publication Date 2/14/2017 
Target
Name:
Peptidyl-prolyl cis-trans isomerase F, mitochondrial
Synonyms:
CYP3 CyP-M Cyclophilin F Mitochondrial cyclophilin PPIF_HUMAN Rotamase F
Type:
PROTEIN
Mol. Mass.:
22052.60
Organism:
Homo sapiens (Human)
Description:
ChEMBL_109465
Residue:
207
  
Inhibitor
Name:
BDBM50030542
Synonyms:
CHEMBL3344495 | US9566312, Compound 2.5.2
Type:
Small organic molecule
Emp. Form.:
C66H118N12O13
Mol. Mass.:
1287.7157
SMILES:
[H][C@@]1([C@H](C)CN2CCOCC2)N(C)C(=O)[C@@H](C)N(C)C(=O)[C@H](CC)NC(=O)[C@]([H])([C@H](O)[C@H](C)C\C=C\C)N(C)C(=O)[C@H](C(C)C)N(C)C(=O)[C@H](CC(C)C)N(C)C(=O)[C@H](CC(C)C)N(C)C(=O)[C@@H](C)NC(=O)[C@H](C)NC(=O)[C@H](CC(C)C)N(C)C(=O)[C@@H](NC1=O)C(C)C
: