Target
Peptidyl-prolyl cis-trans isomerase A
Ligand
BDBM286531
Substrate
Meas. Tech.
Surface Plasmon Resonance (SPR) Assay
pH
7.4±n/a
Kd
1.000±n/a nM
Comments
extracted
Citation
 Fu, JKarur, SLi, XLu, PMergo, WRivkin, ASweeney, ZKTjandra, MWeiss, AYifru, A Cyclic peptides and use as medicines US Patent  US9566312 Publication Date 2/14/2017 
Target
Name:
Peptidyl-prolyl cis-trans isomerase A
Synonyms:
CYPA Cyclophilin A PPIA PPIase A Rotamase A
Type:
Protein
Mol. Mass.:
18015.32
Organism:
Homo sapiens (Human)
Description:
P62937
Residue:
165
  
Inhibitor
Name:
BDBM286531
Synonyms:
US9566312, Compound 2.5.12
Type:
Small organic molecule
Emp. Form.:
C69H125N13O12
Mol. Mass.:
1328.8107
SMILES:
CC[C@@H]1NC(=O)[C@H]([C@H](O)[C@H](C)C\C=C\C)N(C)C(=O)[C@H](C(C)C)N(C)C(=O)[C@H](CC(C)C)N(C)C(=O)[C@H](CC(C)C)N(C)C(=O)[C@@H](C)NC(=O)[C@H](C)NC(=O)[C@H](CC(C)C)N(C)C(=O)[C@@H](NC(=O)[C@H]([C@H](C)CN2CCN(CC2)C(C)C)N(C)C(=O)[C@@H](C)N(C)C1=O)C(C)C
: