Target
Peptidyl-prolyl cis-trans isomerase F, mitochondrial
Ligand
BDBM286559
Substrate
Meas. Tech.
Surface Plasmon Resonance (SPR) Assay
pH
7.4±n/a
Kd
5.30±n/a nM
Comments
extracted
Citation
 Fu, JKarur, SLi, XLu, PMergo, WRivkin, ASweeney, ZKTjandra, MWeiss, AYifru, A Cyclic peptides and use as medicines US Patent  US9566312 Publication Date 2/14/2017 
Target
Name:
Peptidyl-prolyl cis-trans isomerase F, mitochondrial
Synonyms:
CYP3 CyP-M Cyclophilin F Mitochondrial cyclophilin PPIF_HUMAN Rotamase F
Type:
PROTEIN
Mol. Mass.:
22052.60
Organism:
Homo sapiens (Human)
Description:
ChEMBL_109465
Residue:
207
  
Inhibitor
Name:
BDBM286559
Synonyms:
US9566312, Compound 2.6.5
Type:
Small organic molecule
Emp. Form.:
C71H126F3N13O14
Mol. Mass.:
1442.834
SMILES:
CC[C@H](NC(=O)[C@H]([C@H](O)[C@H](C)C\C=C\C)N(C)C(=O)[C@H](C(C)C)N(C)C(=O)[C@H](CC(C)C)N(C)C(=O)[C@H](CC(C)C)N(C)C(=O)[C@@H](C)NC(=O)[C@H](C)NC(=O)[C@H](CC(C)C)N(C)C(=O)[C@@H](NC(=O)[C@@H](NC)[C@H](C)COCC(=O)N1CCN(CC(F)(F)F)CC1)C(C)C)C(=O)N(C)[C@H](C)C(C)=O
: