Target
Peptidyl-prolyl cis-trans isomerase B
Ligand
BDBM286615
Substrate
Meas. Tech.
Surface Plasmon Resonance (SPR) Assay
pH
7.4±n/a
Kd
0.500±n/a nM
Comments
extracted
Citation
 Fu, JKarur, SLi, XLu, PMergo, WRivkin, ASweeney, ZKTjandra, MWeiss, AYifru, A Cyclic peptides and use as medicines US Patent  US9566312 Publication Date 2/14/2017 
Target
Name:
Peptidyl-prolyl cis-trans isomerase B
Synonyms:
CYP-S1 Cyclophilin B PPIB PPIase Rotamase SCYLP
Type:
Protein
Mol. Mass.:
23751.82
Organism:
Homo sapiens (Human)
Description:
P23284
Residue:
216
  
Inhibitor
Name:
BDBM286615
Synonyms:
US9566312, Compound 2.20.2
Type:
Small organic molecule
Emp. Form.:
C70H126N12O14
Mol. Mass.:
1359.8214
SMILES:
CC[C@@H]1NC(=O)[C@H]([C@H](O)[C@H](C)C\C=C\C)N(C)C(=O)[C@H](C(C)C)N(C)C(=O)[C@H](CC(C)C)N(C)C(=O)[C@H](CC(C)C)N(C)C(=O)[C@@H](C)NC(=O)[C@H](C)NC(=O)[C@H](CC(C)C)N(C)C(=O)[C@@H](NC(=O)[C@H]([C@H](C)COCC2CN(CCO2)C(C)C)N(C)C(=O)[C@@H](C)N(C)C1=O)C(C)C
: