Target
Amine oxidase [flavin-containing] A
Ligand
BDBM153463
Substrate
Meas. Tech.
Fluorescent-Based (Inhibitor) Screening Assay
pH
7.5±n/a
IC50
7400±n/a nM
Comments
extracted
Citation
 Guibourt, NOrtega Munoz, ACastro-Palomino Laria, J Phenylcyclopropylamine derivatives and their medical use US Patent  US8993808 Publication Date 3/31/2015 
Target
Name:
Amine oxidase [flavin-containing] A
Synonyms:
AOFA_HUMAN MAO-A Monoamine oxidase Monoamine oxidase type A (MAO A) Monoamine oxidase type A (MAOA)
Type:
Protein
Mol. Mass.:
59689.53
Organism:
Homo sapiens (Human)
Description:
P21397
Residue:
527
  
Inhibitor
Name:
BDBM153463
Synonyms:
US8993808, 61
Type:
Small organic molecule
Emp. Form.:
C21H25NO
Mol. Mass.:
307.4293
SMILES:
CC1(C)CCc2cc(CN[C@H]3CC3c3ccccc3)ccc2O1
: