Target
Amine oxidase [flavin-containing] B
Ligand
BDBM153436
Substrate
Meas. Tech.
Fluorescent-Based (Inhibitor) Screening Assay
pH
7.5±n/a
IC50
1900±n/a nM
Comments
extracted
Citation
 Guibourt, NOrtega Munoz, ACastro-Palomino Laria, J Phenylcyclopropylamine derivatives and their medical use US Patent  US8993808 Publication Date 3/31/2015 
Target
Name:
Amine oxidase [flavin-containing] B
Synonyms:
AOFB_HUMAN MAOB Monoamine oxidase type B (MAO B) Monoamine oxidase type B (MAOB)
Type:
Protein
Mol. Mass.:
58768.76
Organism:
Homo sapiens (Human)
Description:
P27338
Residue:
520
  
Inhibitor
Name:
BDBM153436
Synonyms:
US8993808, 34
Type:
Small organic molecule
Emp. Form.:
C19H18N2
Mol. Mass.:
274.3596
SMILES:
C(N[C@H]1CC1c1ccccc1)c1cnc2ccccc2c1
: