Target
Cyclin-dependent kinase 1
Ligand
BDBM153480
Substrate
Meas. Tech.
Enzyme Inhibition Assay
IC50
3600±n/a nM
Citation
 Belmont, POMeijer, LCohen, PPatin, ABosson, JGoekjian, PG Tetrahydrocyclopenta[c]acridine derivatives as kinase inhibitors and biological US Patent  US8999955 Publication Date 4/7/2015 
Target
Name:
Cyclin-dependent kinase 1
Synonyms:
CDC2 CDK1 CDKN1 Cell division protein kinase 1 P34CDC2 | p34 protein kinase
Type:
Enzyme Subunit
Mol. Mass.:
34101.08
Organism:
Homo sapiens (Human)
Description:
P06493
Residue:
297
  
Inhibitor
Name:
BDBM153480
Synonyms:
US8999955, 5-chloro-1-trimethylsilanyl-3,3a,4,5-tetrahydro-2H-cyclopenta[c]acridin-2-one
Type:
Small organic molecule
Emp. Form.:
C19H20ClNOSi
Mol. Mass.:
341.907
SMILES:
C[Si](C)(C)C1=C2C(CC1=O)CC(Cl)c1cc3ccccc3nc21
: