Target
Cyclin-dependent kinase 1
Ligand
BDBM153483
Substrate
Meas. Tech.
Enzyme Inhibition Assay
IC50
1700±n/a nM
Citation
 Belmont, POMeijer, LCohen, PPatin, ABosson, JGoekjian, PG Tetrahydrocyclopenta[c]acridine derivatives as kinase inhibitors and biological US Patent  US8999955 Publication Date 4/7/2015 
Target
Name:
Cyclin-dependent kinase 1
Synonyms:
CDC2 CDK1 CDKN1 Cell division protein kinase 1 P34CDC2 | p34 protein kinase
Type:
Enzyme Subunit
Mol. Mass.:
34101.08
Organism:
Homo sapiens (Human)
Description:
P06493
Residue:
297
  
Inhibitor
Name:
BDBM153483
Synonyms:
US8999955, 5-hydroxy-8,9-methoxy-1-trimethylsilanyl-3,3a,4,5-tetrahydro-2H-cyclopenta[c]acridin-2-one
Type:
Small organic molecule
Emp. Form.:
C21H25NO4Si
Mol. Mass.:
383.513
SMILES:
COc1cc2cc3C(O)CC4CC(=O)C(=C4c3nc2cc1OC)[Si](C)(C)C
: