Target
Cyclin-dependent kinase 5
Ligand
BDBM153477
Substrate
Meas. Tech.
Enzyme Inhibition Assay
IC50
3000±n/a nM
Citation
 Belmont, POMeijer, LCohen, PPatin, ABosson, JGoekjian, PG Tetrahydrocyclopenta[c]acridine derivatives as kinase inhibitors and biological US Patent  US8999955 Publication Date 4/7/2015 
Target
Name:
Cyclin-dependent kinase 5
Synonyms:
CDK5 CDKN5 Cyclin-dependent kinase 5 (CDK5/ p25) Cyclin-dependent-like kinase 5 PSSALRE Tau protein kinase II catalytic subunit
Type:
Enzyme Subunit
Mol. Mass.:
33308.61
Organism:
Homo sapiens (Human)
Description:
Residue:
292
  
Inhibitor
Name:
BDBM153477
Synonyms:
US8999955, 5-hydroxy-1-trimethylsilanyl-3,3a,4,5-tetrahydro-2H-cyclopenta[c]acridin-2-one (+ enantiomer) US8999955, 5-hydroxy-1-trimethylsilanyl-3,3a,4,5-tetrahydro-2H-cyclopenta[c]acridin-2-one (racemic)
Type:
Small organic molecule
Emp. Form.:
C19H21NO2Si
Mol. Mass.:
323.461
SMILES:
C[Si](C)(C)C1=C2C(CC1=O)CC(O)c1cc3ccccc3nc21
: