Target
Serine/threonine-protein kinase TBK1
Ligand
BDBM3175
Substrate
Meas. Tech.
KinEASE-STK Assay
IC50
656± 64 nM
Citation
 Richters, ABasu, DEngel, JErcanoglu, MSBalke-Want, HTesch, RThomas, RKRauh, D Identification and further development of potent TBK1 inhibitors. ACS Chem Biol 10:289-98 (2015)  
Target
Name:
Serine/threonine-protein kinase TBK1
Synonyms:
NAK Protein cereblon/Serine/threonine-protein kinase TBK1 TANK-binding kinase 1 (TBK-1) TBK1 | TBK1_HUMAN
Type:
protein
Mol. Mass.:
83645.20
Organism:
Homo sapiens (Human)
Description:
Q9UHD2
Residue:
729
  
Inhibitor
Name:
BDBM3175
Synonyms:
3-[1-[3-(Amidinothio)propyl]-3-indolyl]-4-(1-methyl-3-indolyl)-1H-pyrrole-2,5-dione Methanesulfonate Bisindolylmaleimide 11b CHEMBL6291 Ro 31-8220 [(3-{3-[4-(1-methyl-1H-indol-3-yl)-2,5-dioxo-2,5-dihydro-1H-pyrrol-3-yl]-1H-indol-1-yl}propyl)sulfanyl]methanimidamide
Type:
Small organic molecule
Emp. Form.:
C25H23N5O2S
Mol. Mass.:
457.547
SMILES:
Cn1cc(C2=C(C(=O)NC2=O)c2cn(CCCSC(N)=N)c3ccccc23)c2ccccc12
: