Target
Mitogen-activated protein kinase 3
Ligand
BDBM154597
Substrate
Meas. Tech.
Temperature Dependence Fluorescence Assay (TdF)
Kd
118±n/a nM
Citation
 Deng, YZhu, LShipps, Jr., GWLo, SSun, BHuang, XBienstock, CCooper, ABGao, XYao, XZhu, HYKelly, JMBoga, SBAlhassan, ATagat, JRMansoor, UFWilson, KJO'Boyle, BMDaniels, MHSchell, ASiliphaivanh, PFischer, C Heterocyclic compounds as ERK inhibitors US Patent  US8999957 Publication Date 4/7/2015 
Target
Name:
Mitogen-activated protein kinase 3
Synonyms:
Erk1 MK03_MOUSE Prkm3
Type:
Protein
Mol. Mass.:
43066.49
Organism:
Mus musculus (Mouse)
Description:
Q63844
Residue:
380
  
Inhibitor
Name:
BDBM154597
Synonyms:
US8999957, Column 152, Compound 2 | US8999957, Table 1, Compound 4
Type:
Small organic molecule
Emp. Form.:
C25H25N5O
Mol. Mass.:
411.4989
SMILES:
O=C(N[C@H]1CCCN(Cc2ccccc2)C1)c1ccc2[nH]nc(-c3ccncc3)c2c1
: