Target
Prostaglandin E2 receptor EP1 subtype
Ligand
BDBM154981
Substrate
Meas. Tech.
In Vitro Binding Assay
pH
7.4±n/a
Ki
>17400±n/a nM
Comments
extracted
Citation
 Manninen, PRWarshawsky, AM Phenoxyethoxy compounds US Patent  US9000043 Publication Date 4/7/2015 
Target
Name:
Prostaglandin E2 receptor EP1 subtype
Synonyms:
PE2R1_HUMAN PTGER1 Prostaglandin E2 receptor EP1 subtype Prostanoid EP1 receptor
Type:
Enzyme
Mol. Mass.:
41834.57
Organism:
Homo sapiens (Human)
Description:
P34995
Residue:
402
  
Inhibitor
Name:
BDBM154981
Synonyms:
US9000043, 1
Type:
Small organic molecule
Emp. Form.:
C22H27NO5
Mol. Mass.:
385.4535
SMILES:
CC(C)[C@@H](OCCOc1ccccc1)C(=O)N[C@@H](C)c1ccc(cc1)C(O)=O
: