Target
Beta-secretase 1
Ligand
BDBM155148
Substrate
Meas. Tech.
TR-FRET Assay
pH
2.5±n/a
IC50
>5000±n/a nM
Comments
extracted
Citation
 Karlstrom, SSoderman, PSwahn, BRakos, LOhberg, L Cycloalkyl ether compounds and their use as BACE inhibitors US Patent  US9000185 Publication Date 4/7/2015 
Target
Name:
Beta-secretase 1
Synonyms:
ASP2 Aspartyl protease 2 BACE1 Beta-secretase (BACE) Beta-secretase 1 (BACE 1) Beta-secretase 1 (BACE1) Beta-site amyloid precursor protein cleaving enzyme 1 Memapsin-2 beta-Secretase (BACE-1) | beta-Secretase (BACE1)
Type:
Protein
Mol. Mass.:
55755.10
Organism:
Homo sapiens (Human)
Description:
P56817
Residue:
501
  
Inhibitor
Name:
BDBM155148
Synonyms:
US9000185, 4, isomer 2
Type:
Small organic molecule
Emp. Form.:
C22H29N3O2
Mol. Mass.:
367.4846
SMILES:
CO[C@H]1CC[C@@]2(Cc3ccc(OCC4CC4)cc3[C@]22N=C(C)C(N)=N2)CC1
: