Target
Fibroblast growth factor receptor 1
Ligand
BDBM287519
Substrate
Meas. Tech.
Caliper-Based Kinase Assay
Temperature
298.15±n/a K
IC50
1.20±n/a nM
Comments
extracted
Citation
 Verner, EBrameld, KA Quinolone derivatives as fibroblast growth factor receptor inhibitors US Patent  US9567334 Publication Date 2/14/2017 
Target
Name:
Fibroblast growth factor receptor 1
Synonyms:
BFGFR Basic fibroblast growth factor receptor 1 (FGFR1) CEK FGFR-1 FGFR-1, (FL) FGFR1_HUMAN FLT2 Fibroblast growth factor receptor 1 (FGFR-1) Fms-like tyrosine kinase 2 N-sam bFGF-R | c-fgr
Type:
Receptor
Mol. Mass.:
91861.70
Organism:
Homo sapiens (Human)
Description:
P11362
Residue:
822
  
Inhibitor
Name:
BDBM287519
Synonyms:
8-(2-((1-acryloylazetidin-3-yl)oxy)ethyl)-6-(2,6-dichloro-3,5-dimethoxyphenyl)-2-((3-(4-ethylpiperazin-1-yl)propyl)amino)pyrido[2,3-d]pyrimidin-7(8H)-one US11078199, Cpd 91 US9815834, Compound 91
Type:
Small organic molecule
Emp. Form.:
C32H41Cl2N7O5
Mol. Mass.:
674.618
SMILES:
CCN1CCN(CCCNc2ncc3cc(-c4c(Cl)c(OC)cc(OC)c4Cl)c(=O)n(CCOC4CN(C4)C(=O)C=C)c3n2)CC1
: