Target
E3 ubiquitin-protein ligase XIAP
Ligand
BDBM156057
Substrate
Meas. Tech.
In vitro Competitive Displacement Binding Assays
pH
7.5±n/a
Temperature
298.15±n/a K
IC50
270±n/a nM
Comments
extracted
Citation
 Woolford, AJHoward, SBuck, IMChessari, GJohnson, CNTamanini, EDay, JEChiarparin, EHeightman, TDFrederickson, MGriffiths-Jones, CM Bicyclic heterocycle compounds and their uses in therapy US Patent  US9018214 Publication Date 4/28/2015 
Target
Name:
E3 ubiquitin-protein ligase XIAP
Synonyms:
API3 E3 ubiquitin-protein ligase XIAP Inhibitor of apoptosis protein 3 X-linked inhibitor of apoptosis XIAP | XIAP_HUMAN
Type:
Protein
Mol. Mass.:
56685.27
Organism:
Homo sapiens (Human)
Description:
P98170
Residue:
497
  
Inhibitor
Name:
BDBM156057
Synonyms:
US9018214, 108
Type:
Small organic molecule
Emp. Form.:
C22H31ClN4O3
Mol. Mass.:
434.96
SMILES:
C[C@@H]1CN(CC(=O)N2CC(C)(C)c3ccc(Cl)cc23)[C@H](CN1)C(=O)N1CCOCC1
: